{"text_format":"3","workbook":"xlsx","n_sheets":3,"sheets":["Sales Data","Sales Report","Inventory"],"not_rendered":{"defined_names":10,"pivot_tables":1},"read":"whole","date_system":"1900"}

{"sheet":"Sales Data","index":0,"n_rows":13,"n_cols":11,"rows_kept":13}
[]
[null,"DAILY CASH REGISTER SALES"]
[]
[]
[]
[{"$nulls":10}," "]
[{"$nulls":10}," "]
[null,"DATE","TIME","TRANSACTION NUMBER","SKU/PRODUCT NUMBER","DESCRIPTION","SALES AMOUNT","TAX %","SALES TAX","TOTAL"]
[null,"2012-02-01","10:30:00",1001,90001,{"$f":"IFERROR(IF(ISNA(VLOOKUP(tblSalesData[[#This Row],[SKU/PRODUCT NUMBER]],tblInventory[],2,0)),\"\",VLOOKUP(tblSalesData[[#This Row],[SKU/PRODUCT NUMBER]],tblInventory[],2,0)),\"No description found\")","v":"Blanket"},{"v":74.95,"d":"$74.95"},{"v":0.05,"d":"5.00%"},{"$f":"tblSalesData[[#This Row],[SALES AMOUNT]]*tblSalesData[[#This Row],[TAX %]]","v":{"v":3.7475000000000005,"d":"$3.75"}},{"$f":"tblSalesData[[#This Row],[SALES AMOUNT]]+tblSalesData[[#This Row],[SALES TAX]]","v":{"v":78.6975,"d":"$78.70"}}]
[null,"2012-02-01","10:33:00",1002,90023,{"$f":"IFERROR(IF(ISNA(VLOOKUP(tblSalesData[[#This Row],[SKU/PRODUCT NUMBER]],tblInventory[],2,0)),\"\",VLOOKUP(tblSalesData[[#This Row],[SKU/PRODUCT NUMBER]],tblInventory[],2,0)),\"No description found\")","v":"Table cloth, 6' round"},{"v":34.99,"d":"$34.99"},{"v":0.05,"d":"5.00%"},{"$f":"tblSalesData[[#This Row],[SALES AMOUNT]]*tblSalesData[[#This Row],[TAX %]]","v":{"v":1.7495000000000003,"d":"$1.75"}},{"$f":"tblSalesData[[#This Row],[SALES AMOUNT]]+tblSalesData[[#This Row],[SALES TAX]]","v":{"v":36.7395,"d":"$36.74"}}]
[null,"2012-02-01","10:45:00",1003,90005,{"$f":"IFERROR(IF(ISNA(VLOOKUP(tblSalesData[[#This Row],[SKU/PRODUCT NUMBER]],tblInventory[],2,0)),\"\",VLOOKUP(tblSalesData[[#This Row],[SKU/PRODUCT NUMBER]],tblInventory[],2,0)),\"No description found\")","v":"Round plate"},{"v":55.95,"d":"$55.95"},{"v":0.05,"d":"5.00%"},{"$f":"tblSalesData[[#This Row],[SALES AMOUNT]]*tblSalesData[[#This Row],[TAX %]]","v":{"v":2.7975000000000003,"d":"$2.80"}},{"$f":"tblSalesData[[#This Row],[SALES AMOUNT]]+tblSalesData[[#This Row],[SALES TAX]]","v":{"v":58.7475,"d":"$58.75"}}]
[null,"2012-02-01","10:55:00",1004,90004,{"$f":"IFERROR(IF(ISNA(VLOOKUP(tblSalesData[[#This Row],[SKU/PRODUCT NUMBER]],tblInventory[],2,0)),\"\",VLOOKUP(tblSalesData[[#This Row],[SKU/PRODUCT NUMBER]],tblInventory[],2,0)),\"No description found\")","v":"Square plate"},{"v":2.95,"d":"$2.95"},{"v":0.05,"d":"5.00%"},{"$f":"tblSalesData[[#This Row],[SALES AMOUNT]]*tblSalesData[[#This Row],[TAX %]]","v":{"v":0.14750000000000002,"d":"$0.15"}},{"$f":"tblSalesData[[#This Row],[SALES AMOUNT]]+tblSalesData[[#This Row],[SALES TAX]]","v":{"v":3.0975,"d":"$3.10"}}]
[null,"2012-02-01","11:45:00",1005,90002,{"$f":"IFERROR(IF(ISNA(VLOOKUP(tblSalesData[[#This Row],[SKU/PRODUCT NUMBER]],tblInventory[],2,0)),\"\",VLOOKUP(tblSalesData[[#This Row],[SKU/PRODUCT NUMBER]],tblInventory[],2,0)),\"No description found\")","v":"Pillow"},{"v":14.98,"d":"$14.98"},{"v":0.05,"d":"5.00%"},{"$f":"tblSalesData[[#This Row],[SALES AMOUNT]]*tblSalesData[[#This Row],[TAX %]]","v":{"v":0.7490000000000001,"d":"$0.75"}},{"$f":"tblSalesData[[#This Row],[SALES AMOUNT]]+tblSalesData[[#This Row],[SALES TAX]]","v":{"v":15.729000000000001,"d":"$15.73"}}]

{"sheet":"Sales Report","index":1,"n_rows":14,"n_cols":7,"rows_kept":14}
[]
[null,"DAILY CASH REGISTER SALES"]
[]
[]
[]
[]
[]
[null,"SKU/PRODUCT NUMBER","DESCRIPTION","DATE","Sales Amount ","Sales Tax ","Total "]
[null,90001,"Blanket","2012-02-01",{"v":74.95,"d":"$74.95"},{"v":3.7475000000000005,"d":"$3.75"},{"v":78.6975,"d":"$78.70"}]
[null,90002,"Pillow","2012-02-01",{"v":14.98,"d":"$14.98"},{"v":0.7490000000000001,"d":"$0.75"},{"v":15.729000000000001,"d":"$15.73"}]
[null,90004,"Square plate","2012-02-01",{"v":2.95,"d":"$2.95"},{"v":0.14750000000000002,"d":"$0.15"},{"v":3.0975,"d":"$3.10"}]
[null,90005,"Round plate","2012-02-01",{"v":55.95,"d":"$55.95"},{"v":2.7975000000000003,"d":"$2.80"},{"v":58.7475,"d":"$58.75"}]
[null,90023,"Table cloth, 6' round","2012-02-01",{"v":34.99,"d":"$34.99"},{"v":1.7495000000000003,"d":"$1.75"},{"v":36.7395,"d":"$36.74"}]
[null,"Grand Total",null,null,{"v":183.82000000000002,"d":"$183.82"},{"v":9.191000000000003,"d":"$9.19"},{"v":193.011,"d":"$193.01"}]

{"sheet":"Inventory","index":2,"n_rows":31,"n_cols":3,"rows_kept":31}
[]
[null,"DAILY CASH REGISTER SALES"]
[]
[]
[]
[]
[]
[null,"SKU/PRODUCT NUMBER","DESCRIPTION"]
[null,90001,"Blanket"]
[null,90002,"Pillow"]
[null,90003,"Sheets"]
[null,90004,"Square plate"]
[null,90005,"Round plate"]
[null,90006,"Bowl, large"]
[null,90007,"Bowl, small"]
[null,90008,"Round plate, small"]
[null,90009,"Fork, small"]
[null,90010,"Fork, large"]
[null,90011,"Spoon, small"]
[null,90012,"Spoon, large"]
[null,90013,"Butter knife, small"]
[null,90014,"Butter knife, large"]
[null,90015,"Table cloth, 10x5"]
[null,90016,"Table cloth, 8x5"]
[null,90017,"Table cloth, 8x8"]
[null,90018,"Table cloth, 6x6"]
[null,90019,"Table cloth, 6x4"]
[null,90020,"Table cloth, 4x4"]
[null,90021,"Table cloth, 10' round"]
[null,90022,"Table cloth, 8' round"]
[null,90023,"Table cloth, 6' round"]