{"text_format":"3","workbook":"xlsx","n_sheets":3,"sheets":["PROJECT PARAMETERS","PROJECT DETAILS","PROJECT TOTALS"],"not_rendered":{"charts":2,"defined_names":3,"pivot_tables":1},"read":"whole","date_system":"1900"}

{"sheet":"PROJECT PARAMETERS","index":0,"n_rows":21,"n_cols":9,"rows_kept":21}
[]
[null,"[Company Name]"]
[null,"Project Planning for Law Firms"]
[null,"Company Confidential"]
[]
[null,"Shaded cells are calculated for you. You do not need to enter anything into them."]
[null,"PROJECT TYPE","GENERAL PARTNER","BUSINESS LAWYER","DEFENSE LITIGATOR","INTELLECTUAL PROPERTY LAWYER","BANKRUPTCY LAWYER","ADMIN STAFF","TOTAL"]
[null,"Business Incorporation",{"v":0.1,"d":"10%"},{"v":0.4,"d":"40%"},{"v":0,"d":"0%"},{"v":0,"d":"0%"},{"v":0,"d":"0%"},{"v":0.5,"d":"50%"},{"$f":"SUM(tblParameters[[#This Row],[GENERAL PARTNER]:[ADMIN STAFF]])","v":{"v":1,"d":"100%"}}]
[null,"Business Acquisition",{"v":0.1,"d":"10%"},{"v":0.4,"d":"40%"},{"v":0,"d":"0%"},{"v":0.1,"d":"10%"},{"v":0,"d":"0%"},{"v":0.4,"d":"40%"},{"$f":"SUM(tblParameters[[#This Row],[GENERAL PARTNER]:[ADMIN STAFF]])","v":{"v":1,"d":"100%"}}]
[null,"Product Liability Defense",{"v":0.2,"d":"20%"},{"v":0,"d":"0%"},{"v":0.5,"d":"50%"},{"v":0,"d":"0%"},{"v":0,"d":"0%"},{"v":0.3,"d":"30%"},{"$f":"SUM(tblParameters[[#This Row],[GENERAL PARTNER]:[ADMIN STAFF]])","v":{"v":1,"d":"100%"}}]
{"$rows_left_out":12}
{"sheet":"PROJECT DETAILS","index":1,"n_rows":29,"n_cols":23,"rows_kept":29,"merged":[[4,11,4,16],[4,17,4,22]]}
[]
[null,{"$f":"'PROJECT PARAMETERS'!B2","v":"[Company Name]"}]
[null,"Project Planning for Law Firms"]
[null,"Company Confidential"]
[{"$nulls":11},"PLANNING",{"$nulls":5},"ACTUALS"]
[null,"PROJECT NAME","PROJECT TYPE","ESTIMATED START","ESTIMATED FINISH","ACTUAL START","ACTUAL FINISH","ESTIMATED WORK","ACTUAL WORK","ESTIMATED DURATION","ACTUAL DURATION","GENERAL PARTNER","BUSINESS LAWYER","DEFENSE LITIGATOR","INTELLECTUAL PROPERTY LAWYER","BANKRUPTCY LAWYER","ADMIN STAFF","GENERAL PARTNER 2","BUSINESS LAWYER 2","DEFENSE LITIGATOR 2","INTELLECTUAL PROPERTY LAWYER 2","BANKRUPTCY LAWYER 2","ADMIN STAFF 2"]
[null,"A. Datum Corporation","Business Incorporation","2013-06-09","2013-08-07","2013-06-29","2013-09-03",200,220,{"$f":"DAYS360(tblDetails[[#This Row],[ESTIMATED START]],tblDetails[[#This Row],[ESTIMATED FINISH]],FALSE)","v":58},{"$f":"DAYS360(tblDetails[[#This Row],[ACTUAL START]],tblDetails[[#This Row],[ACTUAL FINISH]],FALSE)","v":64},{"$f":"INDEX(tblParameters[],MATCH(tblDetails[[#This Row],[PROJECT TYPE]],tblParameters[PROJECT TYPE],0),MATCH(tblDetails[[#Headers],[GENERAL PARTNER]],tblParameters[#Headers],0))*INDEX('PROJECT PARAMETERS'!$B$14:$H$14,1,MATCH(tblDetails[[#Headers],[GENERAL PARTNER]],tblParameters[#Headers],0))*tblDetails[[#This Row],[ESTIMATED WORK]]","v":{"v":7000,"d":"$7,000"}},{"$f":"INDEX(tblParameters[],MATCH(tblDetails[[#This Row],[PROJECT TYPE]],tblParameters[PROJECT TYPE],0),MATCH(tblDetails[[#Headers],[BUSINESS LAWYER]],tblParameters[#Headers],0))*INDEX('PROJECT PARAMETERS'!$B$14:$H$14,1,MATCH(tblDetails[[#Headers],[BUSINESS LAWYER]],tblParameters[#Headers],0))*tblDetails[[#This Row],[ESTIMATED WORK]]","v":{"v":20000,"d":"$20,000"}},{"$f":"INDEX(tblParameters[],MATCH(tblDetails[[#This Row],[PROJECT TYPE]],tblParameters[PROJECT TYPE],0),MATCH(tblDetails[[#Headers],[DEFENSE LITIGATOR]],tblParameters[#Headers],0))*INDEX('PROJECT PARAMETERS'!$B$14:$H$14,1,MATCH(tblDetails[[#Headers],[DEFENSE LITIGATOR]],tblParameters[#Headers],0))*tblDetails[[#This Row],[ESTIMATED WORK]]","v":{"v":0,"d":"$0"}},{"$f":"INDEX(tblParameters[],MATCH(tblDetails[[#This Row],[PROJECT TYPE]],tblParameters[PROJECT TYPE],0),MATCH(tblDetails[[#Headers],[INTELLECTUAL PROPERTY LAWYER]],tblParameters[#Headers],0))*INDEX('PROJECT PARAMETERS'!$B$14:$H$14,1,MATCH(tblDetails[[#Headers],[INTELLECTUAL PROPERTY LAWYER]],tblParameters[#Headers],0))*tblDetails[[#This Row],[ESTIMATED WORK]]","v":{"v":0,"d":"$0"}},{"$f":"INDEX(tblParameters[],MATCH(tblDetails[[#This Row],[PROJECT TYPE]],tblParameters[PROJECT TYPE],0),MATCH(tblDetails[[#Headers],[BANKRUPTCY LAWYER]],tblParameters[#Headers],0))*INDEX('PROJECT PARAMETERS'!$B$14:$H$14,1,MATCH(tblDetails[[#Headers],[BANKRUPTCY LAWYER]],tblParameters[#Headers],0))*tblDetails[[#This Row],[ESTIMATED WORK]]","v":{"v":0,"d":"$0"}},{"$f":"INDEX(tblParameters[],MATCH(tblDetails[[#This Row],[PROJECT TYPE]],tblParameters[PROJECT TYPE],0),MATCH(tblDetails[[#Headers],[ADMIN STAFF]],tblParameters[#Headers],0))*INDEX('PROJECT PARAMETERS'!$B$14:$H$14,1,MATCH(tblDetails[[#Headers],[ADMIN STAFF]],tblParameters[#Headers],0))*tblDetails[[#This Row],[ESTIMATED WORK]]","v":{"v":12500,"d":"$12,500"}},{"$f":"INDEX(tblParameters[],MATCH(tblDetails[[#This Row],[PROJECT TYPE]],tblParameters[PROJECT TYPE],0),MATCH(tblDetails[[#Headers],[GENERAL PARTNER]],tblParameters[#Headers],0))*INDEX('PROJECT PARAMETERS'!$B$14:$H$14,1,MATCH(tblDetails[[#Headers],[GENERAL PARTNER]],tblParameters[#Headers],0))*tblDetails[[#This Row],[ACTUAL WORK]]","v":{"v":7700,"d":"$7,700"}},{"$f":"INDEX(tblParameters[],MATCH(tblDetails[[#This Row],[PROJECT TYPE]],tblParameters[PROJECT TYPE],0),MATCH(tblDetails[[#Headers],[BUSINESS LAWYER]],tblParameters[#Headers],0))*INDEX('PROJECT PARAMETERS'!$B$14:$H$14,1,MATCH(tblDetails[[#Headers],[BUSINESS LAWYER]],tblParameters[#Headers],0))*tblDetails[[#This Row],[ACTUAL WORK]]","v":{"v":22000,"d":"$22,000"}},{"$f":"INDEX(tblParameters[],MATCH(tblDetails[[#This Row],[PROJECT TYPE]],tblParameters[PROJECT TYPE],0),MATCH(tblDetails[[#Headers],[DEFENSE LITIGATOR]],tblParameters[#Headers],0))*INDEX('PROJECT PARAMETERS'!$B$14:$H$14,1,MATCH(tblDetails[[#Headers],[DEFENSE LITIGATOR]],tblParameters[#Headers],0))*tblDetails[[#This Row],[ACTUAL WORK]]","v":{"v":0,"d":"$0"}},{"$f":"INDEX(tblParameters[],MATCH(tblDetails[[#This Row],[PROJECT TYPE]],tblParameters[PROJECT TYPE],0),MATCH(tblDetails[[#Headers],[INTELLECTUAL PROPERTY LAWYER]],tblParameters[#Headers],0))*INDEX('PROJECT PARAMETERS'!$B$14:$H$14,1,MATCH(tblDetails[[#Headers],[INTELLECTUAL PROPERTY LAWYER]],tblParameters[#Headers],0))*tblDetails[[#This Row],[ACTUAL WORK]]","v":{"v":0,"d":"$0"}},{"$f":"INDEX(tblParameters[],MATCH(tblDetails[[#This Row],[PROJECT TYPE]],tblParameters[PROJECT TYPE],0),MATCH(tblDetails[[#Headers],[BANKRUPTCY LAWYER]],tblParameters[#Headers],0))*INDEX('PROJECT PARAMETERS'!$B$14:$H$14,1,MATCH(tblDetails[[#Headers],[BANKRUPTCY LAWYER]],tblParameters[#Headers],0))*tblDetails[[#This Row],[ACTUAL WORK]]","v":{"v":0,"d":"$0"}},{"$f":"INDEX(tblParameters[],MATCH(tblDetails[[#This Row],[PROJECT TYPE]],tblParameters[PROJECT TYPE],0),MATCH(tblDetails[[#Headers],[ADMIN STAFF]],tblParameters[#Headers],0))*INDEX('PROJECT PARAMETERS'!$B$14:$H$14,1,MATCH(tblDetails[[#Headers],[ADMIN STAFF]],tblParameters[#Headers],0))*tblDetails[[#This Row],[ACTUAL WORK]]","v":{"v":13750,"d":"$13,750"}}]
[null,"Adventure Works","Business Acquisition","2013-06-25","2013-07-27","2013-07-15","2013-08-25",400,390,{"$f":"DAYS360(tblDetails[[#This Row],[ESTIMATED START]],tblDetails[[#This Row],[ESTIMATED FINISH]],FALSE)","v":32},{"$f":"DAYS360(tblDetails[[#This Row],[ACTUAL START]],tblDetails[[#This Row],[ACTUAL FINISH]],FALSE)","v":40},{"$f":"INDEX(tblParameters[],MATCH(tblDetails[[#This Row],[PROJECT TYPE]],tblParameters[PROJECT TYPE],0),MATCH(tblDetails[[#Headers],[GENERAL PARTNER]],tblParameters[#Headers],0))*INDEX('PROJECT PARAMETERS'!$B$14:$H$14,1,MATCH(tblDetails[[#Headers],[GENERAL PARTNER]],tblParameters[#Headers],0))*tblDetails[[#This Row],[ESTIMATED WORK]]","v":{"v":14000,"d":"$14,000"}},{"$f":"INDEX(tblParameters[],MATCH(tblDetails[[#This Row],[PROJECT TYPE]],tblParameters[PROJECT TYPE],0),MATCH(tblDetails[[#Headers],[BUSINESS LAWYER]],tblParameters[#Headers],0))*INDEX('PROJECT PARAMETERS'!$B$14:$H$14,1,MATCH(tblDetails[[#Headers],[BUSINESS LAWYER]],tblParameters[#Headers],0))*tblDetails[[#This Row],[ESTIMATED WORK]]","v":{"v":40000,"d":"$40,000"}},{"$f":"INDEX(tblParameters[],MATCH(tblDetails[[#This Row],[PROJECT TYPE]],tblParameters[PROJECT TYPE],0),MATCH(tblDetails[[#Headers],[DEFENSE LITIGATOR]],tblParameters[#Headers],0))*INDEX('PROJECT PARAMETERS'!$B$14:$H$14,1,MATCH(tblDetails[[#Headers],[DEFENSE LITIGATOR]],tblParameters[#Headers],0))*tblDetails[[#This Row],[ESTIMATED WORK]]","v":{"v":0,"d":"$0"}},{"$f":"INDEX(tblParameters[],MATCH(tblDetails[[#This Row],[PROJECT TYPE]],tblParameters[PROJECT TYPE],0),MATCH(tblDetails[[#Headers],[INTELLECTUAL PROPERTY LAWYER]],tblParameters[#Headers],0))*INDEX('PROJECT PARAMETERS'!$B$14:$H$14,1,MATCH(tblDetails[[#Headers],[INTELLECTUAL PROPERTY LAWYER]],tblParameters[#Headers],0))*tblDetails[[#This Row],[ESTIMATED WORK]]","v":{"v":11000,"d":"$11,000"}},{"$f":"INDEX(tblParameters[],MATCH(tblDetails[[#This Row],[PROJECT TYPE]],tblParameters[PROJECT TYPE],0),MATCH(tblDetails[[#Headers],[BANKRUPTCY LAWYER]],tblParameters[#Headers],0))*INDEX('PROJECT PARAMETERS'!$B$14:$H$14,1,MATCH(tblDetails[[#Headers],[BANKRUPTCY LAWYER]],tblParameters[#Headers],0))*tblDetails[[#This Row],[ESTIMATED WORK]]","v":{"v":0,"d":"$0"}},{"$f":"INDEX(tblParameters[],MATCH(tblDetails[[#This Row],[PROJECT TYPE]],tblParameters[PROJECT TYPE],0),MATCH(tblDetails[[#Headers],[ADMIN STAFF]],tblParameters[#Headers],0))*INDEX('PROJECT PARAMETERS'!$B$14:$H$14,1,MATCH(tblDetails[[#Headers],[ADMIN STAFF]],tblParameters[#Headers],0))*tblDetails[[#This Row],[ESTIMATED WORK]]","v":{"v":20000,"d":"$20,000"}},{"$f":"INDEX(tblParameters[],MATCH(tblDetails[[#This Row],[PROJECT TYPE]],tblParameters[PROJECT TYPE],0),MATCH(tblDetails[[#Headers],[GENERAL PARTNER]],tblParameters[#Headers],0))*INDEX('PROJECT PARAMETERS'!$B$14:$H$14,1,MATCH(tblDetails[[#Headers],[GENERAL PARTNER]],tblParameters[#Headers],0))*tblDetails[[#This Row],[ACTUAL WORK]]","v":{"v":13650,"d":"$13,650"}},{"$f":"INDEX(tblParameters[],MATCH(tblDetails[[#This Row],[PROJECT TYPE]],tblParameters[PROJECT TYPE],0),MATCH(tblDetails[[#Headers],[BUSINESS LAWYER]],tblParameters[#Headers],0))*INDEX('PROJECT PARAMETERS'!$B$14:$H$14,1,MATCH(tblDetails[[#Headers],[BUSINESS LAWYER]],tblParameters[#Headers],0))*tblDetails[[#This Row],[ACTUAL WORK]]","v":{"v":39000,"d":"$39,000"}},{"$f":"INDEX(tblParameters[],MATCH(tblDetails[[#This Row],[PROJECT TYPE]],tblParameters[PROJECT TYPE],0),MATCH(tblDetails[[#Headers],[DEFENSE LITIGATOR]],tblParameters[#Headers],0))*INDEX('PROJECT PARAMETERS'!$B$14:$H$14,1,MATCH(tblDetails[[#Headers],[DEFENSE LITIGATOR]],tblParameters[#Headers],0))*tblDetails[[#This Row],[ACTUAL WORK]]","v":{"v":0,"d":"$0"}},{"$f":"INDEX(tblParameters[],MATCH(tblDetails[[#This Row],[PROJECT TYPE]],tblParameters[PROJECT TYPE],0),MATCH(tblDetails[[#Headers],[INTELLECTUAL PROPERTY LAWYER]],tblParameters[#Headers],0))*INDEX('PROJECT PARAMETERS'!$B$14:$H$14,1,MATCH(tblDetails[[#Headers],[INTELLECTUAL PROPERTY LAWYER]],tblParameters[#Headers],0))*tblDetails[[#This Row],[ACTUAL WORK]]","v":{"v":10725,"d":"$10,725"}},{"$f":"INDEX(tblParameters[],MATCH(tblDetails[[#This Row],[PROJECT TYPE]],tblParameters[PROJECT TYPE],0),MATCH(tblDetails[[#Headers],[BANKRUPTCY LAWYER]],tblParameters[#Headers],0))*INDEX('PROJECT PARAMETERS'!$B$14:$H$14,1,MATCH(tblDetails[[#Headers],[BANKRUPTCY LAWYER]],tblParameters[#Headers],0))*tblDetails[[#This Row],[ACTUAL WORK]]","v":{"v":0,"d":"$0"}},{"$f":"INDEX(tblParameters[],MATCH(tblDetails[[#This Row],[PROJECT TYPE]],tblParameters[PROJECT TYPE],0),MATCH(tblDetails[[#Headers],[ADMIN STAFF]],tblParameters[#Headers],0))*INDEX('PROJECT PARAMETERS'!$B$14:$H$14,1,MATCH(tblDetails[[#Headers],[ADMIN STAFF]],tblParameters[#Headers],0))*tblDetails[[#This Row],[ACTUAL WORK]]","v":{"v":19500,"d":"$19,500"}}]
[null,"Alpine Ski House","Product Liability Defense","2013-07-12","2013-09-19","2013-08-07","2013-10-10",500,500,{"$f":"DAYS360(tblDetails[[#This Row],[ESTIMATED START]],tblDetails[[#This Row],[ESTIMATED FINISH]],FALSE)","v":67},{"$f":"DAYS360(tblDetails[[#This Row],[ACTUAL START]],tblDetails[[#This Row],[ACTUAL FINISH]],FALSE)","v":63},{"$f":"INDEX(tblParameters[],MATCH(tblDetails[[#This Row],[PROJECT TYPE]],tblParameters[PROJECT TYPE],0),MATCH(tblDetails[[#Headers],[GENERAL PARTNER]],tblParameters[#Headers],0))*INDEX('PROJECT PARAMETERS'!$B$14:$H$14,1,MATCH(tblDetails[[#Headers],[GENERAL PARTNER]],tblParameters[#Headers],0))*tblDetails[[#This Row],[ESTIMATED WORK]]","v":{"v":35000,"d":"$35,000"}},{"$f":"INDEX(tblParameters[],MATCH(tblDetails[[#This Row],[PROJECT TYPE]],tblParameters[PROJECT TYPE],0),MATCH(tblDetails[[#Headers],[BUSINESS LAWYER]],tblParameters[#Headers],0))*INDEX('PROJECT PARAMETERS'!$B$14:$H$14,1,MATCH(tblDetails[[#Headers],[BUSINESS LAWYER]],tblParameters[#Headers],0))*tblDetails[[#This Row],[ESTIMATED WORK]]","v":{"v":0,"d":"$0"}},{"$f":"INDEX(tblParameters[],MATCH(tblDetails[[#This Row],[PROJECT TYPE]],tblParameters[PROJECT TYPE],0),MATCH(tblDetails[[#Headers],[DEFENSE LITIGATOR]],tblParameters[#Headers],0))*INDEX('PROJECT PARAMETERS'!$B$14:$H$14,1,MATCH(tblDetails[[#Headers],[DEFENSE LITIGATOR]],tblParameters[#Headers],0))*tblDetails[[#This Row],[ESTIMATED WORK]]","v":{"v":75000,"d":"$75,000"}},{"$f":"INDEX(tblParameters[],MATCH(tblDetails[[#This Row],[PROJECT TYPE]],tblParameters[PROJECT TYPE],0),MATCH(tblDetails[[#Headers],[INTELLECTUAL PROPERTY LAWYER]],tblParameters[#Headers],0))*INDEX('PROJECT PARAMETERS'!$B$14:$H$14,1,MATCH(tblDetails[[#Headers],[INTELLECTUAL PROPERTY LAWYER]],tblParameters[#Headers],0))*tblDetails[[#This Row],[ESTIMATED WORK]]","v":{"v":0,"d":"$0"}},{"$f":"INDEX(tblParameters[],MATCH(tblDetails[[#This Row],[PROJECT TYPE]],tblParameters[PROJECT TYPE],0),MATCH(tblDetails[[#Headers],[BANKRUPTCY LAWYER]],tblParameters[#Headers],0))*INDEX('PROJECT PARAMETERS'!$B$14:$H$14,1,MATCH(tblDetails[[#Headers],[BANKRUPTCY LAWYER]],tblParameters[#Headers],0))*tblDetails[[#This Row],[ESTIMATED WORK]]","v":{"v":0,"d":"$0"}},{"$f":"INDEX(tblParameters[],MATCH(tblDetails[[#This Row],[PROJECT TYPE]],tblParameters[PROJECT TYPE],0),MATCH(tblDetails[[#Headers],[ADMIN STAFF]],tblParameters[#Headers],0))*INDEX('PROJECT PARAMETERS'!$B$14:$H$14,1,MATCH(tblDetails[[#Headers],[ADMIN STAFF]],tblParameters[#Headers],0))*tblDetails[[#This Row],[ESTIMATED WORK]]","v":{"v":18750,"d":"$18,750"}},{"$f":"INDEX(tblParameters[],MATCH(tblDetails[[#This Row],[PROJECT TYPE]],tblParameters[PROJECT TYPE],0),MATCH(tblDetails[[#Headers],[GENERAL PARTNER]],tblParameters[#Headers],0))*INDEX('PROJECT PARAMETERS'!$B$14:$H$14,1,MATCH(tblDetails[[#Headers],[GENERAL PARTNER]],tblParameters[#Headers],0))*tblDetails[[#This Row],[ACTUAL WORK]]","v":{"v":35000,"d":"$35,000"}},{"$f":"INDEX(tblParameters[],MATCH(tblDetails[[#This Row],[PROJECT TYPE]],tblParameters[PROJECT TYPE],0),MATCH(tblDetails[[#Headers],[BUSINESS LAWYER]],tblParameters[#Headers],0))*INDEX('PROJECT PARAMETERS'!$B$14:$H$14,1,MATCH(tblDetails[[#Headers],[BUSINESS LAWYER]],tblParameters[#Headers],0))*tblDetails[[#This Row],[ACTUAL WORK]]","v":{"v":0,"d":"$0"}},{"$f":"INDEX(tblParameters[],MATCH(tblDetails[[#This Row],[PROJECT TYPE]],tblParameters[PROJECT TYPE],0),MATCH(tblDetails[[#Headers],[DEFENSE LITIGATOR]],tblParameters[#Headers],0))*INDEX('PROJECT PARAMETERS'!$B$14:$H$14,1,MATCH(tblDetails[[#Headers],[DEFENSE LITIGATOR]],tblParameters[#Headers],0))*tblDetails[[#This Row],[ACTUAL WORK]]","v":{"v":75000,"d":"$75,000"}},{"$f":"INDEX(tblParameters[],MATCH(tblDetails[[#This Row],[PROJECT TYPE]],tblParameters[PROJECT TYPE],0),MATCH(tblDetails[[#Headers],[INTELLECTUAL PROPERTY LAWYER]],tblParameters[#Headers],0))*INDEX('PROJECT PARAMETERS'!$B$14:$H$14,1,MATCH(tblDetails[[#Headers],[INTELLECTUAL PROPERTY LAWYER]],tblParameters[#Headers],0))*tblDetails[[#This Row],[ACTUAL WORK]]","v":{"v":0,"d":"$0"}},{"$f":"INDEX(tblParameters[],MATCH(tblDetails[[#This Row],[PROJECT TYPE]],tblParameters[PROJECT TYPE],0),MATCH(tblDetails[[#Headers],[BANKRUPTCY LAWYER]],tblParameters[#Headers],0))*INDEX('PROJECT PARAMETERS'!$B$14:$H$14,1,MATCH(tblDetails[[#Headers],[BANKRUPTCY LAWYER]],tblParameters[#Headers],0))*tblDetails[[#This Row],[ACTUAL WORK]]","v":{"v":0,"d":"$0"}},{"$f":"INDEX(tblParameters[],MATCH(tblDetails[[#This Row],[PROJECT TYPE]],tblParameters[PROJECT TYPE],0),MATCH(tblDetails[[#Headers],[ADMIN STAFF]],tblParameters[#Headers],0))*INDEX('PROJECT PARAMETERS'!$B$14:$H$14,1,MATCH(tblDetails[[#Headers],[ADMIN STAFF]],tblParameters[#Headers],0))*tblDetails[[#This Row],[ACTUAL WORK]]","v":{"v":18750,"d":"$18,750"}}]
[null,"Baldwin Museum of Science","Patent Application","2013-07-30","2013-09-28","2013-09-14","2013-11-13",150,145,{"$f":"DAYS360(tblDetails[[#This Row],[ESTIMATED START]],tblDetails[[#This Row],[ESTIMATED FINISH]],FALSE)","v":58},{"$f":"DAYS360(tblDetails[[#This Row],[ACTUAL START]],tblDetails[[#This Row],[ACTUAL FINISH]],FALSE)","v":59},{"$f":"INDEX(tblParameters[],MATCH(tblDetails[[#This Row],[PROJECT TYPE]],tblParameters[PROJECT TYPE],0),MATCH(tblDetails[[#Headers],[GENERAL PARTNER]],tblParameters[#Headers],0))*INDEX('PROJECT PARAMETERS'!$B$14:$H$14,1,MATCH(tblDetails[[#Headers],[GENERAL PARTNER]],tblParameters[#Headers],0))*tblDetails[[#This Row],[ESTIMATED WORK]]","v":{"v":5250,"d":"$5,250"}},{"$f":"INDEX(tblParameters[],MATCH(tblDetails[[#This Row],[PROJECT TYPE]],tblParameters[PROJECT TYPE],0),MATCH(tblDetails[[#Headers],[BUSINESS LAWYER]],tblParameters[#Headers],0))*INDEX('PROJECT PARAMETERS'!$B$14:$H$14,1,MATCH(tblDetails[[#Headers],[BUSINESS LAWYER]],tblParameters[#Headers],0))*tblDetails[[#This Row],[ESTIMATED WORK]]","v":{"v":0,"d":"$0"}},{"$f":"INDEX(tblParameters[],MATCH(tblDetails[[#This Row],[PROJECT TYPE]],tblParameters[PROJECT TYPE],0),MATCH(tblDetails[[#Headers],[DEFENSE LITIGATOR]],tblParameters[#Headers],0))*INDEX('PROJECT PARAMETERS'!$B$14:$H$14,1,MATCH(tblDetails[[#Headers],[DEFENSE LITIGATOR]],tblParameters[#Headers],0))*tblDetails[[#This Row],[ESTIMATED WORK]]","v":{"v":0,"d":"$0"}},{"$f":"INDEX(tblParameters[],MATCH(tblDetails[[#This Row],[PROJECT TYPE]],tblParameters[PROJECT TYPE],0),MATCH(tblDetails[[#Headers],[INTELLECTUAL PROPERTY LAWYER]],tblParameters[#Headers],0))*INDEX('PROJECT PARAMETERS'!$B$14:$H$14,1,MATCH(tblDetails[[#Headers],[INTELLECTUAL PROPERTY LAWYER]],tblParameters[#Headers],0))*tblDetails[[#This Row],[ESTIMATED WORK]]","v":{"v":24750,"d":"$24,750"}},{"$f":"INDEX(tblParameters[],MATCH(tblDetails[[#This Row],[PROJECT TYPE]],tblParameters[PROJECT TYPE],0),MATCH(tblDetails[[#Headers],[BANKRUPTCY LAWYER]],tblParameters[#Headers],0))*INDEX('PROJECT PARAMETERS'!$B$14:$H$14,1,MATCH(tblDetails[[#Headers],[BANKRUPTCY LAWYER]],tblParameters[#Headers],0))*tblDetails[[#This Row],[ESTIMATED WORK]]","v":{"v":0,"d":"$0"}},{"$f":"INDEX(tblParameters[],MATCH(tblDetails[[#This Row],[PROJECT TYPE]],tblParameters[PROJECT TYPE],0),MATCH(tblDetails[[#Headers],[ADMIN STAFF]],tblParameters[#Headers],0))*INDEX('PROJECT PARAMETERS'!$B$14:$H$14,1,MATCH(tblDetails[[#Headers],[ADMIN STAFF]],tblParameters[#Headers],0))*tblDetails[[#This Row],[ESTIMATED WORK]]","v":{"v":5625,"d":"$5,625"}},{"$f":"INDEX(tblParameters[],MATCH(tblDetails[[#This Row],[PROJECT TYPE]],tblParameters[PROJECT TYPE],0),MATCH(tblDetails[[#Headers],[GENERAL PARTNER]],tblParameters[#Headers],0))*INDEX('PROJECT PARAMETERS'!$B$14:$H$14,1,MATCH(tblDetails[[#Headers],[GENERAL PARTNER]],tblParameters[#Headers],0))*tblDetails[[#This Row],[ACTUAL WORK]]","v":{"v":5075,"d":"$5,075"}},{"$f":"INDEX(tblParameters[],MATCH(tblDetails[[#This Row],[PROJECT TYPE]],tblParameters[PROJECT TYPE],0),MATCH(tblDetails[[#Headers],[BUSINESS LAWYER]],tblParameters[#Headers],0))*INDEX('PROJECT PARAMETERS'!$B$14:$H$14,1,MATCH(tblDetails[[#Headers],[BUSINESS LAWYER]],tblParameters[#Headers],0))*tblDetails[[#This Row],[ACTUAL WORK]]","v":{"v":0,"d":"$0"}},{"$f":"INDEX(tblParameters[],MATCH(tblDetails[[#This Row],[PROJECT TYPE]],tblParameters[PROJECT TYPE],0),MATCH(tblDetails[[#Headers],[DEFENSE LITIGATOR]],tblParameters[#Headers],0))*INDEX('PROJECT PARAMETERS'!$B$14:$H$14,1,MATCH(tblDetails[[#Headers],[DEFENSE LITIGATOR]],tblParameters[#Headers],0))*tblDetails[[#This Row],[ACTUAL WORK]]","v":{"v":0,"d":"$0"}},{"$f":"INDEX(tblParameters[],MATCH(tblDetails[[#This Row],[PROJECT TYPE]],tblParameters[PROJECT TYPE],0),MATCH(tblDetails[[#Headers],[INTELLECTUAL PROPERTY LAWYER]],tblParameters[#Headers],0))*INDEX('PROJECT PARAMETERS'!$B$14:$H$14,1,MATCH(tblDetails[[#Headers],[INTELLECTUAL PROPERTY LAWYER]],tblParameters[#Headers],0))*tblDetails[[#This Row],[ACTUAL WORK]]","v":{"v":23925,"d":"$23,925"}},{"$f":"INDEX(tblParameters[],MATCH(tblDetails[[#This Row],[PROJECT TYPE]],tblParameters[PROJECT TYPE],0),MATCH(tblDetails[[#Headers],[BANKRUPTCY LAWYER]],tblParameters[#Headers],0))*INDEX('PROJECT PARAMETERS'!$B$14:$H$14,1,MATCH(tblDetails[[#Headers],[BANKRUPTCY LAWYER]],tblParameters[#Headers],0))*tblDetails[[#This Row],[ACTUAL WORK]]","v":{"v":0,"d":"$0"}},{"$f":"INDEX(tblParameters[],MATCH(tblDetails[[#This Row],[PROJECT TYPE]],tblParameters[PROJECT TYPE],0),MATCH(tblDetails[[#Headers],[ADMIN STAFF]],tblParameters[#Headers],0))*INDEX('PROJECT PARAMETERS'!$B$14:$H$14,1,MATCH(tblDetails[[#Headers],[ADMIN STAFF]],tblParameters[#Headers],0))*tblDetails[[#This Row],[ACTUAL WORK]]","v":{"v":5437.5,"d":"$5,438"}}]
{"$rows_left_out":20}
{"sheet":"PROJECT TOTALS","index":2,"n_rows":29,"n_cols":14,"rows_kept":29,"merged":[[4,2,4,7],[4,8,4,13]]}
[]
[null,{"$f":"'PROJECT PARAMETERS'!B2","v":"[Company Name]"}]
[null,{"$f":"'PROJECT PARAMETERS'!B3","v":"Project Planning for Law Firms"}]
[null,{"$f":"'PROJECT PARAMETERS'!B4","v":"Company Confidential"}]
[null,null,"ESTIMATED",{"$nulls":5},"ACTUAL"]
[null,"PROJECT NAME","GENERAL PARTNER ","BUSINESS ","DEFENSE LITIGATOR ","INTELLECTUAL PROPERTY ","BANKRUPTCY ","ADMIN STAFF ","GENERAL PARTNER  ","BUSINESS    ","DEFENSE LITIGATOR  ","BANKRUPTCY  ","INTELLECTUAL PROPERTY  ","ADMIN STAFF  "]
[null,"A. Datum Corporation",{"v":7000,"d":"$7,000.00"},{"v":20000,"d":"$20,000.00"},{"v":0,"d":"$0.00"},{"v":0,"d":"$0.00"},{"v":0,"d":"$0.00"},{"v":12500,"d":"$12,500.00"},{"v":7700,"d":"$7,700.00"},{"v":22000,"d":"$22,000.00"},{"v":0,"d":"$0.00"},{"v":0,"d":"$0.00"},{"v":0,"d":"$0.00"},{"v":13750,"d":"$13,750.00"}]
[null,"Adventure Works",{"v":14000,"d":"$14,000.00"},{"v":40000,"d":"$40,000.00"},{"v":0,"d":"$0.00"},{"v":11000,"d":"$11,000.00"},{"v":0,"d":"$0.00"},{"v":20000,"d":"$20,000.00"},{"v":13650,"d":"$13,650.00"},{"v":39000,"d":"$39,000.00"},{"v":0,"d":"$0.00"},{"v":0,"d":"$0.00"},{"v":10725,"d":"$10,725.00"},{"v":19500,"d":"$19,500.00"}]
[null,"Alpine Ski House",{"v":35000,"d":"$35,000.00"},{"v":0,"d":"$0.00"},{"v":75000,"d":"$75,000.00"},{"v":0,"d":"$0.00"},{"v":0,"d":"$0.00"},{"v":18750,"d":"$18,750.00"},{"v":35000,"d":"$35,000.00"},{"v":0,"d":"$0.00"},{"v":75000,"d":"$75,000.00"},{"v":0,"d":"$0.00"},{"v":0,"d":"$0.00"},{"v":18750,"d":"$18,750.00"}]
[null,"Baldwin Museum of Science",{"v":5250,"d":"$5,250.00"},{"v":0,"d":"$0.00"},{"v":0,"d":"$0.00"},{"v":24750,"d":"$24,750.00"},{"v":0,"d":"$0.00"},{"v":5625,"d":"$5,625.00"},{"v":5075,"d":"$5,075.00"},{"v":0,"d":"$0.00"},{"v":0,"d":"$0.00"},{"v":0,"d":"$0.00"},{"v":23925,"d":"$23,925.00"},{"v":5437.5,"d":"$5,437.50"}]
{"$rows_left_out":19}